Reaction Details
TargetAlpha-1B adrenergic receptor
LigandBDBM22869
Substrate/Competitorn/a
Ki 39.81±n/a nM
CommentsPDSP_552
Citation Wikberg-Matsson, AWikberg, JEUhlén, S Characterization of alpha1-adrenoceptor subtypes in the pig. Eur J Pharmacol347:301-9 (1998) 
 
Alpha-1B adrenergic receptor
Name:Alpha-1B adrenergic receptor
Type:Enzyme Catalytic Domain
Mol. Mass.:34826.67
Organism:PIG
Description:Q70HQ0
Residue:316
BDBM22869
NameBDBM22869
Synonyms:6-chloro-10-(4-methylpiperazin-1-yl)-2,9-diazatricyclo[9.4.0.0^{3,8}]pentadeca-1,3(8),4,6,10,12,14-heptaene Clozapine US10259786, Clozapine
TypeSmall organic molecule
Emp. Form.C18H19ClN4
Mol. Mass.326.823
SMILESCN1CCN(CC1)C1=c2ccccc2=Nc2ccc(Cl)cc2N1