Reaction Details
TargetAlpha-1B adrenergic receptor
LigandBDBM82424
Substrate/Competitorn/a
Ki 316.23±n/a nM
CommentsPDSP_1319
Citation Wikberg-Matsson, AWikberg, JEUhlén, S Characterization of alpha1-adrenoceptor subtypes in the pig. Eur J Pharmacol347:301-9 (1998) 
 
Alpha-1B adrenergic receptor
Name:Alpha-1B adrenergic receptor
Type:Enzyme Catalytic Domain
Mol. Mass.:34826.67
Organism:PIG
Description:Q70HQ0
Residue:316
BDBM82424
NameBDBM82424
Synonyms:CAS_1236 Niguldipine(+)
TypeSmall organic molecule
Emp. Form.C36H39N3O6
Mol. Mass.609.7114
SMILESCOC(=O)C1C(C(C(=O)OCCCN2CCC(CC2)(c2ccccc2)c2ccccc2)=C(C)N=C1C)c1cccc(c1)[N+]([O-])=O