Reaction Details
Target5-hydroxytryptamine receptor 2C
LigandBDBM81993
Substrate/Competitorn/a
Ki 4674±n/a nM
CommentsPDSP_424
Citation Toll, LBerzetei-Gurske, IPPolgar, WEBrandt, SRAdapa, IDRodriguez, LSchwartz, RWHaggart, DO'Brien, AWhite, AKennedy, JMCraymer, KFarrington, LAuh, JS Standard binding and functional assays related to medications development division testing for potential cocaine and opiate narcotic treatment medications. NIDA Res Monogr178:440-66 (1998) 5-hydroxytryptamine receptor 2C
Name:5-hydroxytryptamine receptor 2C
Type:Enzyme
Mol. Mass.:51935.10
Organism:Rattus norvegicus (Rat)
Description:P08909
Residue:460
BDBM81993
NameBDBM81993
Synonyms:BROMOCRIPTINE Bromocriptine+ (GTP-)
Typen/a
Emp. Form.C32H40BrN5O5
Mol. Mass.654.594
SMILESCC(C)C[C@@H]1N2C(=O)[C@](NC(=O)[C@H]3CN(C)[C@@H]4Cc5c(Br)[nH]c6cccc(C4=C3)c56)(O[C@@]2(O)[C@@H]2CCCN2C1=O)C(C)C