Reaction Details
TargetD(2) dopamine receptor
LigandBDBM50005120
Substrate/Competitorn/a
Ki 0.1±n/a nM
CommentsPDSP_1981
Citation Toll, LBerzetei-Gurske, IPPolgar, WEBrandt, SRAdapa, IDRodriguez, LSchwartz, RWHaggart, DO'Brien, AWhite, AKennedy, JMCraymer, KFarrington, LAuh, JS Standard binding and functional assays related to medications development division testing for potential cocaine and opiate narcotic treatment medications. NIDA Res Monogr178:440-66 (1998) D(2) dopamine receptor
Name:D(2) dopamine receptor
Type:Cell-surface receptors
Mol. Mass.:50647.10
Organism:Homo sapiens (Human)
Description:P14416
Residue:443
BDBM50005120
NameBDBM50005120
Synonyms:CHEMBL274491 N-(1-Benzyl-2-methyl-pyrrolidin-3-yl)-5-chloro-2-methoxy-4-methylamino-benzamide YM-09151-2
TypeSmall organic molecule
Emp. Form.C21H26ClN3O2
Mol. Mass.387.903
SMILESCNc1cc(OC)c(cc1Cl)C(=O)N[C@H]1CCN(Cc2ccccc2)[C@H]1C