Reaction Details
TargetD(3) dopamine receptor
LigandBDBM50017721
Substrate/Competitorn/a
Ki 8±n/a nM
CommentsPDSP_606
Citation Toll, LBerzetei-Gurske, IPPolgar, WEBrandt, SRAdapa, IDRodriguez, LSchwartz, RWHaggart, DO'Brien, AWhite, AKennedy, JMCraymer, KFarrington, LAuh, JS Standard binding and functional assays related to medications development division testing for potential cocaine and opiate narcotic treatment medications. NIDA Res Monogr178:440-66 (1998) D(3) dopamine receptor
Name:D(3) dopamine receptor
Type:n/a
Mol. Mass.:44243.43
Organism:Homo sapiens (Human)
Description:n/a
Residue:400
BDBM50017721
NameBDBM50017721
Synonyms:1-Methyl-4-(5H-dibenzo(a,d)cycloheptenylidene)piperidine 4-(5-dibenzo(a,d)cyclohepten-5-ylidine)-1-methylpiperidine 4-(5H-dibenzo[a,d][7]annulen-5-ylidene)-1-methylpiperidine4-(5H-dibenzo[a,d]cyclohepten-5-ylidene)-1-methylpiperidine CHEMBL516 | CYPROHEPTADINE
TypeSmall organic molecule
Emp. Form.C21H21N
Mol. Mass.287.3981
SMILES[#6]-[#7]-1-[#6]-[#6]\[#6](-[#6]-[#6]-1)=[#6]-1/c2ccccc2-[#6]=[#6]-c2ccccc-12