Reaction Details
TargetDelta-type opioid receptor
LigandBDBM82507
Substrate/Competitorn/a
Ki 132.2±n/a nM
CommentsPDSP_1
Citation Toll, LBerzetei-Gurske, IPPolgar, WEBrandt, SRAdapa, IDRodriguez, LSchwartz, RWHaggart, DO'Brien, AWhite, AKennedy, JMCraymer, KFarrington, LAuh, JS Standard binding and functional assays related to medications development division testing for potential cocaine and opiate narcotic treatment medications. NIDA Res Monogr178:440-66 (1998) Delta-type opioid receptor
Name:Delta-type opioid receptor
Type:G Protein-Coupled Receptor (GPCR)
Mol. Mass.:40382.98
Organism:Homo sapiens (Human)
Description:Competition binding assays were carried out using membrane preparations from transfected HN9.10 cells that constitutively expressed the delta opioid receptor.
Residue:372
BDBM82507
NameBDBM82507
Synonyms:(+/-)-Methadone METHADONE NSC_22266
TypeSmall organic molecule
Emp. Form.C21H27NO
Mol. Mass.309.4452
SMILESCCC(=O)C(CC(C)N(C)C)(c1ccccc1)c1ccccc1