Reaction Details
TargetKappa-type opioid receptor
LigandBDBM82552
Substrate/Competitorn/a
Ki 4.1±n/a nM
CommentsPDSP_1396
Citation Toll, LBerzetei-Gurske, IPPolgar, WEBrandt, SRAdapa, IDRodriguez, LSchwartz, RWHaggart, DO'Brien, AWhite, AKennedy, JMCraymer, KFarrington, LAuh, JS Standard binding and functional assays related to medications development division testing for potential cocaine and opiate narcotic treatment medications. NIDA Res Monogr178:440-66 (1998) Kappa-type opioid receptor
Name:Kappa-type opioid receptor
Type:G Protein-Coupled Receptor (GPCR)
Mol. Mass.:42648.76
Organism:Homo sapiens (Human)
Description:P41145
Residue:380
BDBM82552
NameBDBM82552
Synonyms:CAS_111555-58-9 naltrindolebenzofuran
TypeSmall organic molecule
Emp. Form.C26H25NO4
Mol. Mass.415.481
SMILESOc1ccc2C[C@H]3N(CC4CC4)CC[C@@]45[C@@H](Oc1c24)c1oc2ccccc2c1C[C@@]35O