Reaction Details
TargetEndothelin-1 receptor
LigandBDBM50061077
Substrate/Competitorn/a
Ki 1.5±n/a nM
CommentsPDSP_1667
Citation Ohlstein, EHNambi, PHay, DWGellai, MBrooks, DPLuengo, JXiang, JNElliott, JD Nonpeptide endothelin receptor antagonists. XI. Pharmacological characterization of SB 234551, a high-affinity and selective nonpeptide ETA receptor antagonist. J Pharmacol Exp Ther286:650-6 (1998) Endothelin-1 receptor
Name:Endothelin-1 receptor
Type:Enzyme Catalytic Domain
Mol. Mass.:48736.88
Organism:Homo sapiens (Human)
Description:P25101
Residue:427
BDBM50061077
NameBDBM50061077
Synonyms:(1S,2R,3S)-1-Benzo[1,3]dioxol-5-yl-3-[2-(2-hydroxy-ethoxy)-4-methoxy-phenyl]-5-propoxy-indan-2-carboxylic acid Enrasentan SB-217242
TypeSmall organic molecule
Emp. Form.C29H30O8
Mol. Mass.506.5437
SMILESCCCOc1ccc2[C@@H]([C@H]([C@@H](c2c1)c1ccc(OC)cc1OCCO)C(O)=O)c1ccc2OCOc2c1