Reaction Details
TargetMu-type opioid receptor
LigandBDBM50027808
Substrate/Competitorn/a
Ki 11.4±n/a nM
CommentsPDSP_767
Citation Goldberg, IERossi, GCLetchworth, SRMathis, JPRyan-Moro, JLeventhal, LSu, WEmmel, DBolan, EAPasternak, GW Pharmacological characterization of endomorphin-1 and endomorphin-2 in mouse brain. J Pharmacol Exp Ther286:1007-13 (1998) Mu-type opioid receptor
Name:Mu-type opioid receptor
Type:Enzyme Catalytic Domain
Mol. Mass.:44431.62
Organism:MOUSE
Description:OPIATE Mu OPRM1 MOUSE::P42866
Residue:398
BDBM50027808
NameBDBM50027808
Synonyms:(Dynorphin)2-[2-(2-{2-[2-(2-{2-[2-Amino-3-(4-hydroxy-phenyl)-propionylamino]-acetylamino}-acetylamino)-3-phenyl-propionylamino]-4-methyl-pentanoylamino}-5-guanidino-pentanoylamino)-5-guanidino-pentanoylamino]-3-methyl-pentanoic acid CHEMBL268984 | Dynorphin B
TypeSmall organic molecule
Emp. Form.C46H72N14O10
Mol. Mass.981.1517
SMILESCC[C@@H](C)[C@H](NC(=O)[C@H](CCCNC(N)=N)NC(=O)[C@H](CCCNC(N)=N)NC(=O)[C@H](CC(C)C)NC(=O)[C@H](Cc1ccccc1)NC(=O)CNC(=O)CNC(=O)[C@@H](N)Cc1ccc(O)cc1)C(O)=O