Reaction Details
TargetMu-type opioid receptor
LigandBDBM50106276
Substrate/Competitorn/a
Ki 1.57±n/a nM
CommentsPDSP_781
Citation Goldberg, IERossi, GCLetchworth, SRMathis, JPRyan-Moro, JLeventhal, LSu, WEmmel, DBolan, EAPasternak, GW Pharmacological characterization of endomorphin-1 and endomorphin-2 in mouse brain. J Pharmacol Exp Ther286:1007-13 (1998) Mu-type opioid receptor
Name:Mu-type opioid receptor
Type:Enzyme Catalytic Domain
Mol. Mass.:44431.62
Organism:MOUSE
Description:OPIATE Mu OPRM1 MOUSE::P42866
Residue:398
BDBM50106276
NameBDBM50106276
Synonyms:1-[2-Amino-3-(4-hydroxy-phenyl)-propionyl]-pyrrolidine-2-carboxylic acid [1-(1-carbamoyl-2-phenyl-ethylcarbamoyl)-2-phenyl-ethyl]-amide (Endomorphin-2) Endomorphin 2
TypeSmall organic molecule
Emp. Form.C32H37N5O5
Mol. Mass.571.6667
SMILESN[C@@H](Cc1ccc(O)cc1)C(=O)N1CCCC1C(=O)N[C@H](Cc1ccccc1)C(=O)N[C@H](Cc1ccccc1)C(N)=O