Reaction Details
TargetMu-type opioid receptor
LigandBDBM85337
Substrate/Competitorn/a
Ki 13.4±n/a nM
CommentsPDSP_1207
Citation Goldberg, IERossi, GCLetchworth, SRMathis, JPRyan-Moro, JLeventhal, LSu, WEmmel, DBolan, EAPasternak, GW Pharmacological characterization of endomorphin-1 and endomorphin-2 in mouse brain. J Pharmacol Exp Ther286:1007-13 (1998) Mu-type opioid receptor
Name:Mu-type opioid receptor
Type:Enzyme Catalytic Domain
Mol. Mass.:44431.62
Organism:MOUSE
Description:OPIATE Mu OPRM1 MOUSE::P42866
Residue:398
BDBM85337
NameBDBM85337
Synonyms:Met5-enkephalin-Arg-Phe | enkephalin-Met, Arg(6)-Phe(7)
TypeSmall organic molecule
Emp. Form.C42H56N10O9S
Mol. Mass.877.021
SMILES[#6]-[#16]-[#6]-[#6]-[#6](-[#7]-[#6](=O)-[#6](-[#6]-c1ccccc1)-[#7]-[#6](=O)-[#6]-[#7]-[#6](=O)-[#6]-[#7]-[#6](=O)-[#6](-[#7])-[#6]-c1ccc(-[#8])cc1)-[#6](=O)-[#7]-[#6](-[#6]-[#6]-[#6]\[#7]=[#6](\[#7])-[#7])-[#6](=O)-[#7]-[#6](-[#6]-c1ccccc1)-[#6](-[#8])=O