Reaction Details
TargetMu-type opioid receptor
LigandBDBM50169774
Substrate/Competitorn/a
Ki 279±n/a nM
CommentsPDSP_1935
Citation Goldberg, IERossi, GCLetchworth, SRMathis, JPRyan-Moro, JLeventhal, LSu, WEmmel, DBolan, EAPasternak, GW Pharmacological characterization of endomorphin-1 and endomorphin-2 in mouse brain. J Pharmacol Exp Ther286:1007-13 (1998) Mu-type opioid receptor
Name:Mu-type opioid receptor
Type:Enzyme Catalytic Domain
Mol. Mass.:44431.62
Organism:MOUSE
Description:OPIATE Mu OPRM1 MOUSE::P42866
Residue:398
BDBM50169774
NameBDBM50169774
Synonyms:2-(3,4-Dichloro-phenyl)-N-methyl-N-(2-pyrrolidin-1-yl-cyclohexyl)-acetamide; compound with methanesulfonic acid U-50488H | U50,488H
TypeSmall organic molecule
Emp. Form.C19H26Cl2N2O
Mol. Mass.369.329
SMILESCN(C1CCCC[C@H]1N1CCCC1)C(=O)Cc1ccc(Cl)c(Cl)c1