Reaction Details
TargetProstaglandin E2 receptor EP3 subtype
LigandBDBM82213
Substrate/Competitorn/a
Ki 1581±n/a nM
CommentsPDSP_1458
Citation Sharif, NAXu, SXWilliams, GWCrider, JYGriffin, BWDavis, TL Pharmacology of [3H]prostaglandin E1/[3H]prostaglandin E2 and [3H]prostaglandin F2alpha binding to EP3 and FP prostaglandin receptor binding sites in bovine corpus luteum: characterization and correlation with functional data. J Pharmacol Exp Ther286:1094-102 (1998) Prostaglandin E2 receptor EP3 subtype
Name:Prostaglandin E2 receptor EP3 subtype
Type:Enzyme Catalytic Domain
Mol. Mass.:46379.75
Organism:BOVINE
Description:Prostaglandin E3 PTGER3 BOVINE::P34979
Residue:417
BDBM82213
NameBDBM82213
Synonyms:CAS_41598-07-6 PGD2
TypeSmall organic molecule
Emp. Form.C20H30O4
Mol. Mass.334.4498
SMILESCCCCCC(O)CC=C1C(CC=CCCCC(O)=O)C=CC1=O