Reaction Details
TargetProstaglandin E2 receptor EP3 subtype
LigandBDBM85183
Substrate/Competitorn/a
Ki 21±n/a nM
CommentsPDSP_1786
Citation Sharif, NAXu, SXWilliams, GWCrider, JYGriffin, BWDavis, TL Pharmacology of [3H]prostaglandin E1/[3H]prostaglandin E2 and [3H]prostaglandin F2alpha binding to EP3 and FP prostaglandin receptor binding sites in bovine corpus luteum: characterization and correlation with functional data. J Pharmacol Exp Ther286:1094-102 (1998) Prostaglandin E2 receptor EP3 subtype
Name:Prostaglandin E2 receptor EP3 subtype
Type:Enzyme Catalytic Domain
Mol. Mass.:46379.75
Organism:BOVINE
Description:Prostaglandin E3 PTGER3 BOVINE::P34979
Residue:417
BDBM85183
NameBDBM85183
Synonyms:CAS_60325-46-4 SULPROSTONE
TypeSmall organic molecule
Emp. Form.C23H31NO7S
Mol. Mass.465.56
SMILESCS(=O)(=O)NC(=O)CCCC=CCC1C(C=CC(O)COc2ccccc2)C(O)CC1=O