Reaction Details
TargetProstaglandin F2-alpha receptor
LigandBDBM85347
Substrate/Competitorn/a
Ki>10000±n/a nM
CommentsPDSP_459
Citation Sharif, NAXu, SXWilliams, GWCrider, JYGriffin, BWDavis, TL Pharmacology of [3H]prostaglandin E1/[3H]prostaglandin E2 and [3H]prostaglandin F2alpha binding to EP3 and FP prostaglandin receptor binding sites in bovine corpus luteum: characterization and correlation with functional data. J Pharmacol Exp Ther286:1094-102 (1998) Prostaglandin F2-alpha receptor
Name:Prostaglandin F2-alpha receptor
Type:Enzyme Catalytic Domain
Mol. Mass.:41044.75
Organism:BOVINE
Description:ProstaglandinF2Alpha PTGFR BOVINE::P37289
Residue:362
BDBM85347
NameBDBM85347
Synonyms:BWA868C NSC_122021
TypeSmall organic molecule
Emp. Form.C25H37N3O5
Mol. Mass.459.5784
SMILESOC(CNn1c(CCCCCCC(O)=O)c(O)n(Cc2ccccc2)c1=O)C1CCCCC1