Reaction Details
TargetProstaglandin F2-alpha receptor
LigandBDBM85173
Substrate/Competitorn/a
Ki 100±n/a nM
CommentsPDSP_841
Citation Sharif, NAXu, SXWilliams, GWCrider, JYGriffin, BWDavis, TL Pharmacology of [3H]prostaglandin E1/[3H]prostaglandin E2 and [3H]prostaglandin F2alpha binding to EP3 and FP prostaglandin receptor binding sites in bovine corpus luteum: characterization and correlation with functional data. J Pharmacol Exp Ther286:1094-102 (1998) Prostaglandin F2-alpha receptor
Name:Prostaglandin F2-alpha receptor
Type:Enzyme Catalytic Domain
Mol. Mass.:41044.75
Organism:BOVINE
Description:ProstaglandinF2Alpha PTGFR BOVINE::P37289
Residue:362
BDBM85173
NameBDBM85173
Synonyms:CAS_40666-16-8 NSC_5311100
TypeSmall organic molecule
Emp. Form.C23H29F3O6
Mol. Mass.458.468
SMILESOC(COc1cccc(c1)C(F)(F)F)C=CC1C(O)CC(O)C1CC=CCCCC(O)=O