Reaction Details
TargetProstaglandin F2-alpha receptor
LigandBDBM85174
Substrate/Competitorn/a
Ki>10000±n/a nM
CommentsPDSP_888
Citation Sharif, NAXu, SXWilliams, GWCrider, JYGriffin, BWDavis, TL Pharmacology of [3H]prostaglandin E1/[3H]prostaglandin E2 and [3H]prostaglandin F2alpha binding to EP3 and FP prostaglandin receptor binding sites in bovine corpus luteum: characterization and correlation with functional data. J Pharmacol Exp Ther286:1094-102 (1998) Prostaglandin F2-alpha receptor
Name:Prostaglandin F2-alpha receptor
Type:Enzyme Catalytic Domain
Mol. Mass.:41044.75
Organism:BOVINE
Description:ProstaglandinF2Alpha PTGFR BOVINE::P37289
Residue:362
BDBM85174
NameBDBM85174
Synonyms:CAS_5311224 NSC_5311224
TypeSmall organic molecule
Emp. Form.C34H37NO8
Mol. Mass.587.6595
SMILESOC(COC1C(O)CC(=O)C1CCC=CCCC(=O)Oc1ccc(NC(=O)c2ccccc2)cc1)COc1ccccc1