Reaction Details
TargetProstaglandin F2-alpha receptor
LigandBDBM85342
Substrate/Competitorn/a
Ki 98±n/a nM
CommentsPDSP_1486
Citation Sharif, NAXu, SXWilliams, GWCrider, JYGriffin, BWDavis, TL Pharmacology of [3H]prostaglandin E1/[3H]prostaglandin E2 and [3H]prostaglandin F2alpha binding to EP3 and FP prostaglandin receptor binding sites in bovine corpus luteum: characterization and correlation with functional data. J Pharmacol Exp Ther286:1094-102 (1998) Prostaglandin F2-alpha receptor
Name:Prostaglandin F2-alpha receptor
Type:Enzyme Catalytic Domain
Mol. Mass.:41044.75
Organism:BOVINE
Description:ProstaglandinF2Alpha PTGFR BOVINE::P37289
Residue:362
BDBM85342
NameBDBM85342
Synonyms:CAS_170548 PHXA85
TypeSmall organic molecule
Emp. Form.C23H34O5
Mol. Mass.390.5131
SMILESOC(CCC1C(O)CC(O)C1CC=CCCCC(O)=O)CCc1ccccc1