Reaction Details
TargetMetabotropic glutamate receptor 1
LigandBDBM82355
Substrate/Competitorn/a
Ki>10000±n/a nM
CommentsPDSP_6983
Citation Bräuner-Osborne, HNielsen, BKrogsgaard-Larsen, P Molecular pharmacology of homologues of ibotenic acid at cloned metabotropic glutamic acid receptors. Eur J Pharmacol350:311-6 (1998) 
 
Metabotropic glutamate receptor 1
Name:Metabotropic glutamate receptor 1
Type:Enzyme Catalytic Domain
Mol. Mass.:133240.47
Organism:RAT
Description:metabotropic glutamate 1/2 0 RAT::P23385
Residue:1199
BDBM82355
NameBDBM82355
Synonyms:Amino-(3-hydroxy-isoxazol-5-yl)-acetic acid(Ibotenic acid) CHEMBL284895 Ibotenic acid | NSC_1233
TypeSmall organic molecule
Emp. Form.C5H6N2O4
Mol. Mass.158.1121
SMILESNC(C(O)=O)c1cc(=O)[nH]o1