Reaction Details
TargetGalanin receptor type 3
LigandBDBM85073
Substrate/Competitorn/a
Ki 39.81±n/a nM
CommentsPDSP_3166
Citation Smith, KEWalker, MWArtymyshyn, RBard, JBorowsky, BTamm, JAYao, WJVaysse, PJBranchek, TAGerald, CJones, KA Cloned human and rat galanin GALR3 receptors. Pharmacology and activation of G-protein inwardly rectifying K+ channels. J Biol Chem273:23321-6 (1998) 
 
Galanin receptor type 3
Name:Galanin receptor type 3
Type:Enzyme Catalytic Domain
Mol. Mass.:39599.97
Organism:Homo sapiens (Human)
Description:Galanin R3 GALR3 HUMAN::O60755
Residue:368
BDBM85073
NameBDBM85073
Synonyms:CAS_3043476 NSC_3043476
TypeSmall organic molecule
Emp. Form.C23H30N2O3
Mol. Mass.382.4959
SMILESCOc1ccccc1N(CCOc1ccc(C)cc1)C(=O)CN1CCCCC1