Reaction Details
TargetMetabotropic glutamate receptor 2
LigandBDBM85212
Substrate/Competitorn/a
Ki 0.078±n/a nM
CommentsPDSP_2011
Citation Mutel, VAdam, GChaboz, SKemp, JAKlingelschmidt, AMesser, JWichmann, JWoltering, TRichards, JG Characterization of (2S,2'R,3'R)-2-(2',3'-[3H]-dicarboxycyclopropyl)glycine binding in rat brain. J Neurochem71:2558-64 (1998) 
 
Metabotropic glutamate receptor 2
Name:Metabotropic glutamate receptor 2
Type:Enzyme
Mol. Mass.:95584.88
Organism:Homo sapiens (Human)
Description:Q14416
Residue:872
BDBM85212
NameBDBM85212
Synonyms:CAS_5311260 NSC_5311260
TypeSmall organic molecule
Emp. Form.C12H13N5O6
Mol. Mass.323.2615
SMILESNC(Cn1cnc2c1[nH]c(=O)[nH]c2=O)(C1CC1C(O)=O)C(O)=O