Reaction Details
TargetMuscarinic acetylcholine receptor M4
LigandBDBM81799
Substrate/Competitorn/a
Ki 16.59±n/a nM
CommentsPDSP_931
Citation Chelala, JLKilani, AMiller, MJMartin, RJErnsberger, P Muscarinic receptor binding sites of the M4 subtype in porcine lung parenchyma. Pharmacol Toxicol83:200-7 (1998) 
 
Muscarinic acetylcholine receptor M4
Name:Muscarinic acetylcholine receptor M4
Type:Enzyme Catalytic Domain
Mol. Mass.:53079.31
Organism:Homo sapiens (Human)
Description:Cholinergic, muscarinic M4 CHRM4 HUMAN M3::P08173
Residue:479
BDBM81799
NameBDBM81799
Synonyms:CAS_98299-40-2 NSC_3602 | hexahydrosiladifenidol
TypeSmall organic molecule
Emp. Form.C20H33NOSi
Mol. Mass.331.5676
SMILESO[Si](CCCN1CCCCC1)(C1CCCCC1)c1ccccc1