Reaction Details
TargetMuscarinic acetylcholine receptor
LigandBDBM50071173
Substrate/Competitorn/a
Ki 10.71±n/a nM
CommentsPDSP_933
Citation Chelala, JLKilani, AMiller, MJMartin, RJErnsberger, P Muscarinic receptor binding sites of the M4 subtype in porcine lung parenchyma. Pharmacol Toxicol83:200-7 (1998) 
 
Muscarinic acetylcholine receptor
Name:Muscarinic acetylcholine receptor
Type:Enzyme Catalytic Domain
Mol. Mass.:50324.85
Organism:PORCINE
Description:F1SIA0
Residue:479
BDBM50071173
NameBDBM50071173
Synonyms:(3R,4R,4aS,8aR)-4-[(E)-2-((2S,6S)-1,6-Dimethyl-piperidin-2-yl)-vinyl]-3-methyl-decahydro-naphtho[2,3-c]furan-1-one HIMBACINE
TypeSmall organic molecule
Emp. Form.C22H35NO2
Mol. Mass.345.5188
SMILESC[C@H]1OC(=O)C2C[C@H]3CCCC[C@@H]3[C@@H](\C=C\[C@@H]3CCC[C@H](C)N3C)C12