Reaction Details
TargetMuscarinic acetylcholine receptor M4
LigandBDBM82423
Substrate/Competitorn/a
Ki 0.4±n/a nM
CommentsPDSP_1916
Citation Chelala, JLKilani, AMiller, MJMartin, RJErnsberger, P Muscarinic receptor binding sites of the M4 subtype in porcine lung parenchyma. Pharmacol Toxicol83:200-7 (1998) 
 
Muscarinic acetylcholine receptor M4
Name:Muscarinic acetylcholine receptor M4
Type:Enzyme Catalytic Domain
Mol. Mass.:52841.70
Organism:RAT
Description:Cholinergic, muscarinic M4 CHRM4 RAT::P08485
Residue:477
BDBM82423
NameBDBM82423
Synonyms:CAS_132947 TRIPITRAMINE
TypeSmall organic molecule
Emp. Form.C64H77N13O6
Mol. Mass.1124.3797
SMILESCN(CCCCCCCCN(C)CCCCCCN(CC(=O)N1c2ccccc2C(=O)Nc2cccnc12)CC(=O)N1c2ccccc2C(=O)Nc2cccnc12)CCCCCCNCC(=O)N1c2ccccc2C(=O)Nc2cccnc12