Reaction Details
TargetCapsid scaffolding protein
LigandBDBM275768
Substrate/Competitorn/a
Meas. Tech.HCMV antiviral assay
EC50 470±0.13 nM
Citation Hostetler, KYBeadle, JR Phosphonate compounds US Patent US10071110 Publication Date 9/11/2018
 
Capsid scaffolding protein
Name:Capsid scaffolding protein
Type:PROTEIN
Mol. Mass.:73854.16
Organism:Human cytomegalovirus (strain AD169) (HHV-5) (Human herpesvirus 5)
Description:ChEMBL_158958
Residue:708
BDBM275768
NameBDBM275768
Synonyms:CYCLIC CIDOFOVIR US10071110, Compound Cyclic Cidofovir (cDCV) | US10071110, Compound cCDV
TypeSmall organic molecule
Emp. Form.C8H12N3O5P
Mol. Mass.261.1717
SMILESNc1ccn(CC2COP(O)(=O)CO2)c(=O)n1