Reaction Details
TargetFibroblast growth factor receptor 1
LigandBDBM275780
Substrate/Competitorn/a
Meas. Tech.MRC-5 Human Lung Fibroblasts Assay
EC50 100.0±n/a nM
Citation Hostetler, KYBeadle, JR Phosphonate compounds US Patent US10071110 Publication Date 9/11/2018
 
Fibroblast growth factor receptor 1
Name:Fibroblast growth factor receptor 1
Type:Receptor
Mol. Mass.:91861.70
Organism:Homo sapiens (Human)
Description:P11362
Residue:822
BDBM275780
NameBDBM275780
Synonyms:US10071110, Compound 1-O-hexadecylpropanediol-3-ADV
TypeSmall organic molecule
Emp. Form.C29H54N5O5P
Mol. Mass.583.7433
(O)(=O)COCCn1cnc2c(N)ncnc12