Reaction Details
TargetFibroblast growth factor receptor 1
LigandBDBM275767
Substrate/Competitorn/a
Meas. Tech.CPE reduction assay
EC50 1800±n/a nM
Citation Hostetler, KYBeadle, JR Phosphonate compounds US Patent US10071110 Publication Date 9/11/2018
 
Fibroblast growth factor receptor 1
Name:Fibroblast growth factor receptor 1
Type:Receptor
Mol. Mass.:91861.70
Organism:Homo sapiens (Human)
Description:P11362
Residue:822
BDBM275767
NameBDBM275767
Synonyms:US10071110, Compound CDV | US10071110, Compound Cidofovir(CDV)
TypeSmall organic molecule
Emp. Form.C8H14N3O6P
Mol. Mass.279.187
SMILESNc1ccn(CC(CO)OCP(O)(O)=O)c(=O)n1