Reaction Details
TargetFibroblast growth factor receptor 1
LigandBDBM275768
Substrate/Competitorn/a
Meas. Tech.CPE reduction assay
EC50 970±0 nM
Citation Hostetler, KYBeadle, JR Phosphonate compounds US Patent US10071110 Publication Date 9/11/2018
 
Fibroblast growth factor receptor 1
Name:Fibroblast growth factor receptor 1
Type:Receptor
Mol. Mass.:91861.70
Organism:Homo sapiens (Human)
Description:P11362
Residue:822
BDBM275768
NameBDBM275768
Synonyms:CYCLIC CIDOFOVIR US10071110, Compound Cyclic Cidofovir (cDCV) | US10071110, Compound cCDV
TypeSmall organic molecule
Emp. Form.C8H12N3O5P
Mol. Mass.261.1717
SMILESNc1ccn(CC2COP(O)(=O)CO2)c(=O)n1