Reaction Details
TargetHIV-1 protease
LigandBDBM275768
Substrate/Competitorn/a
Meas. Tech.HSV-1 Antiviral Assay
EC50 2100±n/a nM
Citation Hostetler, KYBeadle, JR Phosphonate compounds US Patent US10071110 Publication Date 9/11/2018
 
HIV-1 protease
Name:HIV-1 protease
Synonyms:n/a
Type:Protein
Mol. Mass.:10794.16
Organism:Human immunodeficiency virus
Description:Q9YQ34
Residue:99
BDBM275768
NameBDBM275768
TypeSmall organic molecule
Emp. Form.C8H12N3O5P
Mol. Mass.261.1717
SMILESNc1ccn(CC2COP(O)(=O)CO2)c(=O)n1