Reaction Details
TargetHIV-1 protease
LigandBDBM275773
Substrate/Competitorn/a
Meas. Tech.HSV-1 Antiviral Assay
EC50 400±0 nM
Citation Hostetler, KYBeadle, JR Phosphonate compounds US Patent US10071110 Publication Date 9/11/2018
 
HIV-1 protease
Name:HIV-1 protease
Synonyms:n/a
Type:Protein
Mol. Mass.:10794.16
Organism:Human immunodeficiency virus
Description:Q9YQ34
Residue:99
BDBM275773
NameBDBM275773
Synonyms:US10071110, Compound 1-O-hexadecylpropanediol-3-CDV
TypeSmall organic molecule
Emp. Form.C27H52N3O7P
Mol. Mass.561.6914
(O)(=O)COC(CO)Cn1ccc(N)nc1=O