Reaction Details
TargetMelatonin receptor type 1B
LigandBDBM85065
Substrate/Competitorn/a
Ki 1737.8±n/a nM
CommentsPDSP_1123
Citation Teh, MTSugden, D Comparison of the structure-activity relationships of melatonin receptor agonists and antagonists: lengthening the N-acyl side-chain has differing effects on potency on Xenopus melanophores. Naunyn Schmiedebergs Arch Pharmacol358:522-8 (1998) 
 
Melatonin receptor type 1B
Name:Melatonin receptor type 1B
Type:Enzyme Catalytic Domain
Mol. Mass.:33012.73
Organism:Chick
Description:Melatonin 0 Chick::P51050
Residue:289
BDBM85065
NameBDBM85065
Synonyms:CAS_117946-91-5 NSC_122162
TypeSmall organic molecule
Emp. Form.C19H20N2O
Mol. Mass.292.3749
SMILESCC(=O)NCCc1c(Cc2ccccc2)[nH]c2ccccc12