Reaction Details
TargetMelatonin receptor type 1C
LigandBDBM85240
Substrate/Competitorn/a
Ki 57.54±n/a nM
CommentsPDSP_177
Citation Teh, MTSugden, D Comparison of the structure-activity relationships of melatonin receptor agonists and antagonists: lengthening the N-acyl side-chain has differing effects on potency on Xenopus melanophores. Naunyn Schmiedebergs Arch Pharmacol358:522-8 (1998) 
 
Melatonin receptor type 1C
Name:Melatonin receptor type 1C
Type:Enzyme Catalytic Domain
Mol. Mass.:47442.40
Organism:Xenopus
Description:Melatonin 1C 0 Xenopus::P49219
Residue:420
BDBM85240
NameBDBM85240
Synonyms:5-MeOT-N-pentanyl
TypeSmall organic molecule
Emp. Form.C19H27N3O2
Mol. Mass.329.4366
SMILESCCCCC(=O)NCCc1ccc2[nH]cc(CCNC(C)=O)c2c1