Reaction Details
TargetMelatonin receptor type 1C
LigandBDBM85384
Substrate/Competitorn/a
Ki 2137.96±n/a nM
CommentsPDSP_1127
Citation Teh, MTSugden, D Comparison of the structure-activity relationships of melatonin receptor agonists and antagonists: lengthening the N-acyl side-chain has differing effects on potency on Xenopus melanophores. Naunyn Schmiedebergs Arch Pharmacol358:522-8 (1998) 
 
Melatonin receptor type 1C
Name:Melatonin receptor type 1C
Type:Enzyme Catalytic Domain
Mol. Mass.:47442.40
Organism:Xenopus
Description:Melatonin 1C 0 Xenopus::P49219
Residue:420
BDBM85384
NameBDBM85384
Synonyms:Luzindole,N-pentanoyl
TypeSmall organic molecule
Emp. Form.C22H26N2O
Mol. Mass.334.4546
SMILESCCCCC(=O)NCCc1c(Cc2ccccc2)[nH]c2ccccc12