Reaction Details
TargetGalanin receptor type 1
LigandBDBM85168
Substrate/Competitorn/a
Ki 0.26±n/a nM
CommentsPDSP_1161
Citation Borowsky, BWalker, MWHuang, LYJones, KASmith, KEBard, JBranchek, TAGerald, C Cloning and characterization of the human galanin GALR2 receptor. Peptides19:1771-81 (1998) 
 
Galanin receptor type 1
Name:Galanin receptor type 1
Type:Enzyme Catalytic Domain
Mol. Mass.:38976.60
Organism:Homo sapiens (Human)
Description:Galanin R1 GALR1 HUMAN::P47211
Residue:349
BDBM85168
NameBDBM85168
Synonyms:M32
TypeSmall organic molecule
Emp. Form.C136H209N41O34
Mol. Mass.2962.369
SMILESCC[C@H](C)[C@H](NC(=O)[C@H](Cc1ccc(O)cc1)NC(=O)[C@H](Cc1cnc[nH]1)NC(=O)[C@H](CCCN=C(N)N)NC(=O)[C@@H]1CCCN1C(=O)CNC(=O)[C@H](CC(C)C)NC(=O)[C@H](CC(C)C)NC(=O)[C@H](Cc1ccc(O)cc1)NC(=O)CNC(=O)[C@H](C)NC(=O)[C@H](CO)NC(=O)[C@H](CC(N)=O)NC(=O)[C@H](CC(C)C)NC(=O)[C@@H](NC(=O)[C@H](Cc1c[nH]c2ccccc12)NC(=O)CN)[C@@H](C)O)C(=O)N[C@@H](CC(N)=O)C(=O)N[C@@H](CC(C)C)C(=O)N[C@@H]([C@@H](C)CC)C(=O)N[C@@H]([C@@H](C)O)C(=O)N[C@@H](CCCN=C(N)N)C(=O)N[C@@H](CCC(N)=O)C(=O)N[C@H](CCCN=C(N)N)C(=O)N[C@@H](Cc1ccc(O)cc1)C(N)=O