Reaction Details
TargetGalanin receptor type 2
LigandBDBM85070
Substrate/Competitorn/a
Ki 0.95±n/a nM
CommentsPDSP_865
Citation Borowsky, BWalker, MWHuang, LYJones, KASmith, KEBard, JBranchek, TAGerald, C Cloning and characterization of the human galanin GALR2 receptor. Peptides19:1771-81 (1998) 
 
Galanin receptor type 2
Name:Galanin receptor type 2
Type:Enzyme Catalytic Domain
Mol. Mass.:41724.40
Organism:Homo sapiens (Human)
Description:Galanin R2 GALR2 HUMAN::O43603
Residue:387
BDBM85070
NameBDBM85070
Synonyms:Galanin, Porcine
TypeSmall organic molecule
Emp. Form.C146H213N43O40
Mol. Mass.3210.5175
SMILESCCC(C)C(NC(=O)C(C)NC(=O)C(Cc1cnc[nH]1)NC(=O)C1CCCN1C(=O)CNC(=O)C(CC(C)C)NC(=O)C(CC(C)C)NC(=O)C(Cc1ccc(O)cc1)NC(=O)CNC(=O)C(C)NC(=O)C(CO)NC(=O)C(CC(N)=O)NC(=O)C(CC(C)C)NC(=O)C(NC(=O)C(Cc1c[nH]c2ccccc12)NC(=O)CN)C(C)O)C(=O)NC(CC(O)=O)C(=O)NC(CC(N)=O)C(=O)NC(Cc1cnc[nH]1)C(=O)NC(CCCN=C(N)N)C(=O)NC(CO)C(=O)NC(Cc1ccccc1)C(=O)NC(Cc1cnc[nH]1)C(=O)NC(CC(O)=O)C(=O)NC(CCCCN)C(=O)NC(Cc1ccc(O)cc1)C(=O)NCC(=O)NC(CC(C)C)C(=O)NC(C)C(N)=O