Reaction Details
Target5-hydroxytryptamine receptor 7
LigandBDBM21342
Substrate/Competitorn/a
Ki 7.94±n/a nM
CommentsPDSP_1091
Citation Hemedah, MCoupar, IMMitchelson, FJ [3H]-Mesulergine labels 5-HT7 sites in rat brain and guinea-pig ileum but not rat jejunum. Br J Pharmacol126:179-88 (1999) 
 
5-hydroxytryptamine receptor 7
Name:5-hydroxytryptamine receptor 7
Type:G Protein-Coupled Receptor (GPCR)
Mol. Mass.:49852.62
Organism:Rattus norvegicus (rat)
Description:Rat cloned 5-HT7R.
Residue:448
BDBM21342
NameBDBM21342
Synonyms:(4R,7R)-N,N-diethyl-6-methyl-6,11-diazatetracyclo[7.6.1.0^{2,7}.0^{12,16}]hexadeca-1(16),2,9,12,14-pentaene-4-carboxamide LSD LSD,(+) Lysergic Acid Diethylamide [3H]-LSD | d-Isolysergic acid amide
Typeradiolabeled ligand
Emp. Form.C20H25N3O
Mol. Mass.323.432
SMILES[H][C@@]12Cc3c[nH]c4cccc(C1=C[C@H](CN2C)C(=O)N(CC)CC)c34