Reaction Details
TargetPromotilin
LigandBDBM50004656
Substrate/Competitorn/a
Ki 158.49±n/a nM
CommentsPDSP_467
Citation Clark, MJWright, TBertrand, PPBornstein, JCJenkinson, KMVerlinden, MFurness, JB Erythromycin derivatives ABT 229 and GM 611 act on motilin receptors in the rabbit duodenum. Clin Exp Pharmacol Physiol26:242-5 (1999) 
 
Promotilin
Name:Promotilin
Type:Enzyme Catalytic Domain
Mol. Mass.:14668.99
Organism:RABBIT
Description:Motilin 0 RABBIT::P27114
Residue:133
BDBM50004656
NameBDBM50004656
Synonyms:(2-Carbamoyloxy-ethyl)-trimethyl-ammonium (2-Hydroxyethyl)trimethyl ammonium chloride carbamate (carbachol)(2-Carbamoyloxy-ethyl)-trimethyl-ammonium 2-((Aminocarbonyl)oxy)-N,N,N-trimethylethanaminum chloride 2-(carbamoyloxy)-N,N,N-trimethylethanaminium chloride CARBASTAT Carbachol chloride Choline carbamate chloride Choline chlorine carbamate Karbamoylcholin chlorid | MIOSTAT
TypeSmall organic molecule
Emp. Form.C6H15N2O2
Mol. Mass.147.195
SMILESC[N+](C)(C)CCOC(N)=O