Reaction Details
TargetCorticotropin-releasing factor receptor 1
LigandBDBM85398
Substrate/Competitorn/a
Ki 22.3±n/a nM
CommentsPDSP_587
Citation Okuyama, SChaki, SKawashima, NSuzuki, YOgawa, SNakazato, AKumagai, TOkubo, TTomisawa, K Receptor binding, behavioral, and electrophysiological profiles of nonpeptide corticotropin-releasing factor subtype 1 receptor antagonists CRA1000 and CRA1001. J Pharmacol Exp Ther289:926-35 (1999) Corticotropin-releasing factor receptor 1
Name:Corticotropin-releasing factor receptor 1
Type:G Protein-Coupled Receptor (GPCR)
Mol. Mass.:47870.75
Organism:Rattus norvegicus (rat)
Description:Receptor binding assays were performed using rat cortex homogenate.
Residue:415
BDBM85398
NameBDBM85398
Synonyms:CRA1001
TypeSmall organic molecule
Emp. Form.C28H32BrFN4
Mol. Mass.523.483
SMILESCCN(c1nc(C)cc(n1)N1CCC=C(C1)c1cccc(F)c1)c1ccc(CC(C)C)cc1Br