Reaction Details
TargetD(2) dopamine receptor
LigandBDBM85413
Substrate/Competitorn/a
Ki 4.1±n/a nM
CommentsPDSP_683
Citation Lawler, CPPrioleau, CLewis, MMMak, CJiang, DSchetz, JAGonzalez, AMSibley, DRMailman, RB Interactions of the novel antipsychotic aripiprazole (OPC-14597) with dopamine and serotonin receptor subtypes. Neuropsychopharmacology20:612-27 (1999) 
 
D(2) dopamine receptor
Name:D(2) dopamine receptor
Type:G Protein-Coupled Receptor (GPCR)
Mol. Mass.:50931.60
Organism:Rattus norvegicus (rat)
Description:P61169
Residue:444
BDBM85413
NameBDBM85413
Synonyms:7-{4-[4-(4-hydroxy-2,3-dimethylphenyl)piperazin-1-yl]butoxy}-1,2,3,4-tetrahydroquinolin-2-one | DM 1451
TypeSmall organic molecule
Emp. Form.C25H33N3O3
Mol. Mass.423.5478
SMILESCc1c(O)ccc(N2CCN(CCCCOc3ccc4CCC(=O)Nc4c3)CC2)c1C