Reaction Details
TargetHexokinase-1
LigandBDBM85421
Substrate/Competitorn/a
Meas. Tech.Enzyme Inhibition Assay
pH7.6±0
Temperature298.15±0 K
IC50 8000000±0.0 nM
Citation Willson, MAlric, IPerie, JSanejouand, YH Yeast hexokinase inhibitors designed from the 3-D enzyme structure rebuilding. J Enzym Inhib12:101-21 (1997) 
 
Hexokinase-1
Name:Hexokinase-1
Type:Protein
Mol. Mass.:53728.20
Organism:Saccharomyces cerevisiae
Description:P04806
Residue:485
BDBM85421
NameBDBM85421
Synonyms:Glucosamine analog, 2
TypeSmall organic molecule
Emp. Form.C14H19NO6
Mol. Mass.297.3038
SMILESCc1ccccc1C(=O)NC1C(O)OC(CO)C(O)C1O