Reaction Details
TargetS-adenosylmethionine synthase isoform type-2
LigandBDBM85452
Substrate/Competitorn/a
Meas. Tech.Inhibition Assay
pH7.5±0
Temperature310.15±0 K
Ki 140000±0.0 nM
IC50 400000±0.0 nM
Citation Lavrador, KAllart, BGuillerm, DGuillerm, G A new series of S-adenosyl-L-methionine synthetase inhibitors. J Enzym Inhib13:361-7 (1998) 
 
S-adenosylmethionine synthase isoform type-2
Name:S-adenosylmethionine synthase isoform type-2
Type:PROTEIN
Mol. Mass.:43713.68
Organism:Rattus norvegicus
Description:ChEMBL_105118
Residue:395
BDBM85452
NameBDBM85452
Synonyms:Epithioamino acid analogue, II(c)
TypeSmall organic molecule
Emp. Form.C6H11NO2S
Mol. Mass.161.222
SMILESC[C@@H]1S[C@@H]1C[C@H](N)C(O)=O