Reaction Details
TargetHistamine H3 receptor
LigandBDBM7966
Substrate/Competitorn/a
Ki>10000±n/a nM
CommentsPDSP_934
Citation Lovenberg, TWRoland, BLWilson, SJJiang, XPyati, JHuvar, AJackson, MRErlander, MG Cloning and functional expression of the human histamine H3 receptor. Mol Pharmacol55:1101-7 (1999) Histamine H3 receptor
Name:Histamine H3 receptor
Type:G Protein-Coupled Receptor (GPCR)
Mol. Mass.:48691.47
Organism:Homo sapiens (Human)
Description:Binding assays were using CHO cells stably expressing hH3R receptors.
Residue:445
BDBM7966
NameBDBM7966
Synonyms:2-(1H-imidazol-4-yl)ethan-1-amine CHEMBL90 Ergotidine Histamine Peremin | [3H]histamine
TypeSmall organic molecule
Emp. Form.C5H9N3
Mol. Mass.111.1451
SMILESNCCc1cnc[nH]1