Reaction Details
TargetBombesin receptor subtype-3
LigandBDBM50063814
Substrate/Competitorn/a
Ki 2800±n/a nM
CommentsPDSP_702
Citation Katsuno, TPradhan, TKRyan, RRMantey, SAHou, WDonohue, PJAkeson, MASpindel, ERBattey, JFCoy, DHJensen, RT Pharmacology and cell biology of the bombesin receptor subtype 4 (BB4-R). Biochemistry38:7307-20 (1999) 
 
Bombesin receptor subtype-3
Name:Bombesin receptor subtype-3
Type:Enzyme Catalytic Domain
Mol. Mass.:44424.45
Organism:Homo sapiens (Human)
Description:Bombesin 3 BRS3 HUMAN::P32247
Residue:399
BDBM50063814
NameBDBM50063814
Synonyms:CHEMBL217438 H-DNal-cyclo[Cys-Tyr-DTrp-Lys-Val-DCys]-Nal-NH2 H-DNal-cyclo[DCys-Tyr-DTrp-Lys-Val-Cys]-Nal-NH2 | H-Nal-cyclo[DCys-Tyr-DTrp-Lys-Val-Cys]-Nal-NH2
TypeSmall organic molecule
Emp. Form.C63H73N11O9S2
Mol. Mass.1192.452
SMILESCC(C)[C@@H]1NC(=O)[C@@H](CCCCN)NC(=O)[C@H](Cc2c[nH]c3ccccc23)NC(=O)[C@@H](Cc2ccc(O)cc2)NC(=O)[C@@H](CSSC[C@H](NC1=O)C(=O)N[C@@H](Cc1ccc2ccccc2c1)C(N)=O)NC(=O)[C@H](N)Cc1ccc2ccccc2c1