Reaction Details
TargetBombesin receptor subtype-3
LigandBDBM85490
Substrate/Competitorn/a
Ki>10000±n/a nM
CommentsPDSP_746
Citation Katsuno, TPradhan, TKRyan, RRMantey, SAHou, WDonohue, PJAkeson, MASpindel, ERBattey, JFCoy, DHJensen, RT Pharmacology and cell biology of the bombesin receptor subtype 4 (BB4-R). Biochemistry38:7307-20 (1999) 
 
Bombesin receptor subtype-3
Name:Bombesin receptor subtype-3
Type:Enzyme Catalytic Domain
Mol. Mass.:44424.45
Organism:Homo sapiens (Human)
Description:Bombesin 3 BRS3 HUMAN::P32247
Residue:399
BDBM85490
NameBDBM85490
Synonyms:DPhe6,Leu13,Psi(CH2NH),Cpa14-Bn(6-14)
TypeSmall organic molecule
Emp. Form.C50H69N15O9
Mol. Mass.1024.178
SMILESCC(C)C[C@@H](CN[C@@H](C#N)C(N)=O)NC(=O)[C@H](Cc1cnc[nH]1)NC(=O)CNC(=O)[C@@H](NC(=O)[C@H](C)NC(=O)[C@H](Cc1c[nH]c2ccccc12)NC(=O)[C@H](CCC(N)=O)NC(=O)[C@H](N)Cc1ccccc1)C(C)C