Reaction Details
TargetBombesin receptor subtype-3
LigandBDBM85492
Substrate/Competitorn/a
Ki>10000±n/a nM
CommentsPDSP_894
Citation Katsuno, TPradhan, TKRyan, RRMantey, SAHou, WDonohue, PJAkeson, MASpindel, ERBattey, JFCoy, DHJensen, RT Pharmacology and cell biology of the bombesin receptor subtype 4 (BB4-R). Biochemistry38:7307-20 (1999) 
 
Bombesin receptor subtype-3
Name:Bombesin receptor subtype-3
Type:Enzyme Catalytic Domain
Mol. Mass.:44424.45
Organism:Homo sapiens (Human)
Description:Bombesin 3 BRS3 HUMAN::P32247
Residue:399
BDBM85492
NameBDBM85492
Synonyms:GRP-10,frog
TypeSmall organic molecule
Emp. Form.C50H73N17O11S
Mol. Mass.1120.287
SMILESCSCC[C@H](NC(=O)[C@H](CC(C)C)NC(=O)[C@H](Cc1cnc[nH]1)NC(=O)CNC(=O)[C@@H](NC(=O)[C@H](C)NC(=O)[C@H](Cc1c[nH]c2ccccc12)NC(=O)[C@H](Cc1cnc[nH]1)NC(=O)[C@H](CC(N)=O)NC(=O)CN)C(C)C)C(N)=O