Reaction Details
TargetBombesin receptor subtype-3
LigandBDBM85483
Substrate/Competitorn/a
Ki 2100±n/a nM
CommentsPDSP_1487
Citation Katsuno, TPradhan, TKRyan, RRMantey, SAHou, WDonohue, PJAkeson, MASpindel, ERBattey, JFCoy, DHJensen, RT Pharmacology and cell biology of the bombesin receptor subtype 4 (BB4-R). Biochemistry38:7307-20 (1999) 
 
Bombesin receptor subtype-3
Name:Bombesin receptor subtype-3
Type:Enzyme Catalytic Domain
Mol. Mass.:44424.45
Organism:Homo sapiens (Human)
Description:Bombesin 3 BRS3 HUMAN::P32247
Residue:399
BDBM85483
NameBDBM85483
Synonyms:CAS_5748287 Phyllolitorin
TypeSmall organic molecule
Emp. Form.C49H69N11O11S
Mol. Mass.1020.204
SMILESCSCCC(NC(=O)C(Cc1ccccc1)NC(=O)C(CO)NC(=O)CNC(=O)C(NC(=O)C(C)NC(=O)C(Cc1c[nH]c2ccccc12)NC(=O)C(CC(C)C)NC(=O)C1CCC(=O)N1)C(C)C)C(N)=O