Reaction Details
TargetBombesin
LigandBDBM81964
Substrate/Competitorn/a
Ki 884±n/a nM
CommentsPDSP_1305
Citation Katsuno, TPradhan, TKRyan, RRMantey, SAHou, WDonohue, PJAkeson, MASpindel, ERBattey, JFCoy, DHJensen, RT Pharmacology and cell biology of the bombesin receptor subtype 4 (BB4-R). Biochemistry38:7307-20 (1999) 
 
Bombesin
Name:Bombesin
Type:Enzyme Catalytic Domain
Mol. Mass.:12340.04
Organism:Frog
Description:Bombesin 4 0 Frog::P84213
Residue:107
BDBM81964
NameBDBM81964
Synonyms:CAS_5486814 NSC_5486814 | Neuromedin C
TypeSmall organic molecule
Emp. Form.C50H73N17O11S
Mol. Mass.1120.287
SMILESCSCCC(NC(=O)C(CC(C)C)NC(=O)C(Cc1cnc[nH]1)NC(=O)CNC(=O)C(NC(=O)C(C)NC(=O)C(Cc1c[nH]c2ccccc12)NC(=O)C(Cc1cnc[nH]1)NC(=O)C(CC(N)=O)NC(=O)CN)C(C)C)C(N)=O