Reaction Details
TargetBombesin
LigandBDBM50071754
Substrate/Competitorn/a
Ki 11±n/a nM
CommentsPDSP_1339
Citation Katsuno, TPradhan, TKRyan, RRMantey, SAHou, WDonohue, PJAkeson, MASpindel, ERBattey, JFCoy, DHJensen, RT Pharmacology and cell biology of the bombesin receptor subtype 4 (BB4-R). Biochemistry38:7307-20 (1999) 
 
Bombesin
Name:Bombesin
Type:Enzyme Catalytic Domain
Mol. Mass.:12340.04
Organism:Frog
Description:Bombesin 4 0 Frog::P84213
Residue:107
BDBM50071754
NameBDBM50071754
Synonyms:(S)-2-[3-(2,6-Diisopropyl-phenyl)-ureido]-3-(1H-indol-3-yl)-2-methyl-N-(1-pyridin-2-yl-cyclohexylmethyl)-propionamide NMB | Xenopus NMB
TypeSmall organic molecule
Emp. Form.C37H47N5O2
Mol. Mass.593.8014
SMILESCC(C)c1cccc(C(C)C)c1NC(=O)N[C@@](C)(Cc1c[nH]c2ccccc12)C(=O)NCC1(CCCCC1)c1ccccn1