Reaction Details
TargetBombesin
LigandBDBM85502
Substrate/Competitorn/a
Ki 5±n/a nM
CommentsPDSP_1473
Citation Katsuno, TPradhan, TKRyan, RRMantey, SAHou, WDonohue, PJAkeson, MASpindel, ERBattey, JFCoy, DHJensen, RT Pharmacology and cell biology of the bombesin receptor subtype 4 (BB4-R). Biochemistry38:7307-20 (1999) 
 
Bombesin
Name:Bombesin
Type:Enzyme Catalytic Domain
Mol. Mass.:12340.04
Organism:Frog
Description:Bombesin 4 0 Frog::P84213
Residue:107
BDBM85502
NameBDBM85502
Synonyms:PG-L
TypeSmall organic molecule
Emp. Form.C62H86N18O16S
Mol. Mass.1371.522
SMILESCSCC[C@H](NC(=O)[C@H](Cc1ccccc1)NC(=O)[C@H](Cc1cnc[nH]1)NC(=O)CNC(=O)[C@@H](NC(=O)[C@H](C)NC(=O)[C@H](Cc1c[nH]c2ccccc12)NC(=O)[C@H](CCC(N)=O)NC(=O)[C@@H]1CCCN1C(=O)CNC(=O)CNC(=O)CNC(=O)[C@@H](N)CCC(O)=O)C(C)C)C(N)=O