Reaction Details
TargetGastrin-releasing peptide receptor
LigandBDBM85484
Substrate/Competitorn/a
Ki 1.31±n/a nM
CommentsPDSP_409
Citation Katsuno, TPradhan, TKRyan, RRMantey, SAHou, WDonohue, PJAkeson, MASpindel, ERBattey, JFCoy, DHJensen, RT Pharmacology and cell biology of the bombesin receptor subtype 4 (BB4-R). Biochemistry38:7307-20 (1999) 
 
Gastrin-releasing peptide receptor
Name:Gastrin-releasing peptide receptor
Type:Enzyme Catalytic Domain
Mol. Mass.:43234.59
Organism:MOUSE
Description:Gastrin-Releasing peptide 0 MOUSE::P21729
Residue:384
BDBM85484
NameBDBM85484
Synonyms:Bombesin
TypeSmall organic molecule
Emp. Form.C71H110N24O18S
Mol. Mass.1619.848
SMILESCSCC[C@H](NC(=O)[C@H](CC(C)C)NC(=O)[C@H](Cc1cnc[nH]1)NC(=O)CNC(=O)[C@@H](NC(=O)[C@H](C)NC(=O)[C@H](Cc1c[nH]c2ccccc12)NC(=O)[C@H](CCC(N)=O)NC(=O)[C@H](CC(N)=O)NC(=O)CNC(=O)[C@H](CC(C)C)NC(=O)[C@H](CCCN=C(N)N)NC(=O)[C@H](CCC(N)=O)NC(=O)[C@@H]1CCC(=O)N1)C(C)C)C(N)=O